{"text_format":"1","workbook":"xlsx","n_sheets":8,"sheets":["Report_4W","intermediate","Report_Weight","Report_Gew90Tage","Report_GewJahr","Report_GewReduktion","data","settings"],"not_rendered":{"charts":7,"images":1,"macros":1,"external_links":0,"defined_names":39,"comments":0,"pivot_tables":0},"unopened":[],"bounds":{"document_bytes":16777216,"sheet_cells":100000,"rows_first":2000,"rows_last":500,"rows_between":2000,"halvings":0,"cell_chars":16384,"cell_head_chars":4096},"cells_cut":0,"cells_raw":0,"read":"whole","date_system":"1900"}

{"sheet":"Report_4W","index":0,"n_rows":4,"n_cols":23,"rows_kept":4,"cut":false,"hidden":false,"merged":[[0,16,0,18],[2,1,2,3],[2,7,2,9],[0,22,0,23],[2,4,2,6],[0,11,0,12]]}
["Name: ",{"$f":"Nachname&\", \"&Vorname","v":", "},null,null,null,null,null,null,null,null,"Geburtsdatum: ",{"$f":"Geburtsdatum","v":"00:00:00"},null,null,null,null,null,null,null,null,null,"Betrachtungszeitraum:",{"$f":"TEXT(MIN(tDatumswerte),\"tt. MMM.\")&\" - \"&TEXT(MAX(tDatumswerte),\"tt. MMM.jjjj\")","v":"00. Jan. - 00. Jan.1900"}]
[]
[null,"Morgens ",null,null,"Mittags ",null,null,"Abends "]
["Datum","Syst.","Diast.","Puls","Syst.","Diast.","Puls","Syst.","Diast.","Puls"]

{"sheet":"intermediate","index":1,"n_rows":334,"n_cols":39,"rows_kept":334,"cut":false,"hidden":true,"merged":[]}
[]
[null,"4W-Datentabelle: Max. Kategorie"]
[]
[null,"Morgens","Mittags","Abends",null,null,null,"Datum1","Tageszeit","Datum2","Syst.","Diast.","Puls","Kat_Morgen","Kat_Mittag","Kat_Abend",null,null,null,null,null,1,2,3,4,5,6,1,2,3,4,5,6,1,2,3,4,5,6]
[null,{"$f":"MAX(VLOOKUP(Report_4W!B5,tKategorien[],3),VLOOKUP(Report_4W!C5,tKategorien[[Limit diast. ]:[Kat.]],2))","v":{"$error":"#N/A"}},{"$f":"MAX(VLOOKUP(Report_4W!E5,tKategorien[],3),VLOOKUP(Report_4W!F5,tKategorien[[Limit diast. ]:[Kat.]],2))","v":{"$error":"#N/A"}},{"$f":"MAX(VLOOKUP(Report_4W!H5,tKategorien[],3),VLOOKUP(Report_4W!I5,tKategorien[[Limit diast. ]:[Kat.]],2))","v":{"$error":"#N/A"}},null,null,null,{"$f":"Start_4W","v":"2022-02-14"},"Morgen",{"$f":"INT(H5)+0.25","v":44606.25},{"$f":"VLOOKUP(tSequence[[#This Row],[Datum2]],tData[[Sort]:[Puls]],2,FALSE)","v":{"$error":"#N/A"}},{"$f":"VLOOKUP(tSequence[[#This Row],[Datum2]],tData[[Sort]:[Puls]],3,FALSE)","v":{"$error":"#N/A"}},{"$f":"VLOOKUP(tSequence[[#This Row],[Datum2]],tData[[Sort]:[Puls]],4,FALSE)","v":{"$error":"#N/A"}},{"$f":"MAX(VLOOKUP($K5,tKategorien[],3),VLOOKUP($L5,tKategorien[[Limit diast. ]:[Kat.]],2))","v":{"$error":"#N/A"}},{"$f":"MAX(VLOOKUP($K6,tKategorien[],3),VLOOKUP($L6,tKategorien[[Limit diast. ]:[Kat.]],2))","v":{"$error":"#N/A"}},{"$f":"MAX(VLOOKUP($K7,tKategorien[],3),VLOOKUP($L7,tKategorien[[Limit diast. ]:[Kat.]],2))","v":{"$error":"#N/A"}},null,null,null,null,null,"Morgens","Morgens","Morgens","Morgens","Morgens","Morgens","Mittags","Mittags","Mittags","Mittags","Mittags","Mittags","Abends","Abends","Abends","Abends","Abends","Abends"]
[null,{"$f":"MAX(VLOOKUP(Report_4W!B6,tKategorien[],3),VLOOKUP(Report_4W!C6,tKategorien[[Limit diast. ]:[Kat.]],2))","v":{"$error":"#N/A"}},{"$f":"MAX(VLOOKUP(Report_4W!E6,tKategorien[],3),VLOOKUP(Report_4W!F6,tKategorien[[Limit diast. ]:[Kat.]],2))","v":{"$error":"#N/A"}},{"$f":"MAX(VLOOKUP(Report_4W!H6,tKategorien[],3),VLOOKUP(Report_4W!I6,tKategorien[[Limit diast. ]:[Kat.]],2))","v":{"$error":"#N/A"}},null,null,null,{"$f":"INT($H$5+(ROW()-5)/3)","v":"2022-02-14"},"Mittag",{"$f":"INT(H6)+0.5","v":44606.5},{"$f":"VLOOKUP(tSequence[[#This Row],[Datum2]],tData[[Sort]:[Puls]],2,FALSE)","v":{"$error":"#N/A"}},{"$f":"VLOOKUP(tSequence[[#This Row],[Datum2]],tData[[Sort]:[Puls]],3,FALSE)","v":{"$error":"#N/A"}},{"$f":"VLOOKUP(tSequence[[#This Row],[Datum2]],tData[[Sort]:[Puls]],4,FALSE)","v":{"$error":"#N/A"}},null,null,null,null,null,null,null,null,"Kat.1","Kat.2","Kat.3","Kat.4","Kat.5","Kat.6","Kat.1","Kat.2","Kat.3","Kat.4","Kat.5","Kat.6","Kat.1","Kat.2","Kat.3","Kat.4","Kat.5","Kat.6"]
[null,{"$f":"MAX(VLOOKUP(Report_4W!B7,tKategorien[],3),VLOOKUP(Report_4W!C7,tKategorien[[Limit diast. ]:[Kat.]],2))","v":{"$error":"#N/A"}},{"$f":"MAX(VLOOKUP(Report_4W!E7,tKategorien[],3),VLOOKUP(Report_4W!F7,tKategorien[[Limit diast. ]:[Kat.]],2))","v":{"$error":"#N/A"}},{"$f":"MAX(VLOOKUP(Report_4W!H7,tKategorien[],3),VLOOKUP(Report_4W!I7,tKategorien[[Limit diast. ]:[Kat.]],2))","v":{"$error":"#N/A"}},null,null,null,"2022-02-14","Abend",{"$f":"INT(H7)+0.75","v":44606.75},{"$f":"VLOOKUP(tSequence[[#This Row],[Datum2]],tData[[Sort]:[Puls]],2,FALSE)","v":{"$error":"#N/A"}},{"$f":"VLOOKUP(tSequence[[#This Row],[Datum2]],tData[[Sort]:[Puls]],3,FALSE)","v":{"$error":"#N/A"}},{"$f":"VLOOKUP(tSequence[[#This Row],[Datum2]],tData[[Sort]:[Puls]],4,FALSE)","v":{"$error":"#N/A"}}]
[null,{"$f":"MAX(VLOOKUP(Report_4W!B8,tKategorien[],3),VLOOKUP(Report_4W!C8,tKategorien[[Limit diast. ]:[Kat.]],2))","v":{"$error":"#N/A"}},{"$f":"MAX(VLOOKUP(Report_4W!E8,tKategorien[],3),VLOOKUP(Report_4W!F8,tKategorien[[Limit diast. ]:[Kat.]],2))","v":{"$error":"#N/A"}},{"$f":"MAX(VLOOKUP(Report_4W!H8,tKategorien[],3),VLOOKUP(Report_4W!I8,tKategorien[[Limit diast. ]:[Kat.]],2))","v":{"$error":"#N/A"}},null,null,null,"2022-02-15","Morgen",{"$f":"INT(H8)+0.25","v":44607.25},{"$f":"VLOOKUP(tSequence[[#This Row],[Datum2]],tData[[Sort]:[Puls]],2,FALSE)","v":{"$error":"#N/A"}},{"$f":"VLOOKUP(tSequence[[#This Row],[Datum2]],tData[[Sort]:[Puls]],3,FALSE)","v":{"$error":"#N/A"}},{"$f":"VLOOKUP(tSequence[[#This Row],[Datum2]],tData[[Sort]:[Puls]],4,FALSE)","v":{"$error":"#N/A"}},{"$f":"MAX(VLOOKUP($K8,tKategorien[],3),VLOOKUP($L8,tKategorien[[Limit diast. ]:[Kat.]],2))","v":{"$error":"#N/A"}},{"$f":"MAX(VLOOKUP($K9,tKategorien[],3),VLOOKUP($L9,tKategorien[[Limit diast. ]:[Kat.]],2))","v":{"$error":"#N/A"}},{"$f":"MAX(VLOOKUP($K10,tKategorien[],3),VLOOKUP($L10,tKategorien[[Limit diast. ]:[Kat.]],2))","v":{"$error":"#N/A"}},null,null,null,{"$f":"WEEKNUM(Start_4W,21)&\"/\"&YEAR(Start_4W)","v":"7/2022"},"Morgens",{"$f":"COUNTIF(intermediate!$N$5:$N$25,V$4)","v":0},{"$f":"COUNTIF(intermediate!$N$5:$N$25,W$4)","v":0},{"$f":"COUNTIF(intermediate!$N$5:$N$25,X$4)","v":0},{"$f":"COUNTIF(intermediate!$N$5:$N$25,Y$4)","v":0},{"$f":"COUNTIF(intermediate!$N$5:$N$25,Z$4)","v":0},{"$f":"COUNTIF(intermediate!$N$5:$N$25,AA$4)","v":0}]
[null,{"$f":"MAX(VLOOKUP(Report_4W!B9,tKategorien[],3),VLOOKUP(Report_4W!C9,tKategorien[[Limit diast. ]:[Kat.]],2))","v":{"$error":"#N/A"}},{"$f":"MAX(VLOOKUP(Report_4W!E9,tKategorien[],3),VLOOKUP(Report_4W!F9,tKategorien[[Limit diast. ]:[Kat.]],2))","v":{"$error":"#N/A"}},{"$f":"MAX(VLOOKUP(Report_4W!H9,tKategorien[],3),VLOOKUP(Report_4W!I9,tKategorien[[Limit diast. ]:[Kat.]],2))","v":{"$error":"#N/A"}},null,null,null,"2022-02-15","Mittag",{"$f":"INT(H9)+0.5","v":44607.5},{"$f":"VLOOKUP(tSequence[[#This Row],[Datum2]],tData[[Sort]:[Puls]],2,FALSE)","v":{"$error":"#N/A"}},{"$f":"VLOOKUP(tSequence[[#This Row],[Datum2]],tData[[Sort]:[Puls]],3,FALSE)","v":{"$error":"#N/A"}},{"$f":"VLOOKUP(tSequence[[#This Row],[Datum2]],tData[[Sort]:[Puls]],4,FALSE)","v":{"$error":"#N/A"}},null,null,null,null,null,null,null,"Mittags",null,null,null,null,null,null,{"$f":"COUNTIF(intermediate!$O$5:$O$25,AB$4)","v":0},{"$f":"COUNTIF(intermediate!$O$5:$O$25,AC$4)","v":0},{"$f":"COUNTIF(intermediate!$O$5:$O$25,AD$4)","v":0},{"$f":"COUNTIF(intermediate!$O$5:$O$25,AE$4)","v":0},{"$f":"COUNTIF(intermediate!$O$5:$O$25,AF$4)","v":0},{"$f":"COUNTIF(intermediate!$O$5:$O$25,AG$4)","v":0}]
[null,{"$f":"MAX(VLOOKUP(Report_4W!B10,tKategorien[],3),VLOOKUP(Report_4W!C10,tKategorien[[Limit diast. ]:[Kat.]],2))","v":{"$error":"#N/A"}},{"$f":"MAX(VLOOKUP(Report_4W!E10,tKategorien[],3),VLOOKUP(Report_4W!F10,tKategorien[[Limit diast. ]:[Kat.]],2))","v":{"$error":"#N/A"}},{"$f":"MAX(VLOOKUP(Report_4W!H10,tKategorien[],3),VLOOKUP(Report_4W!I10,tKategorien[[Limit diast. ]:[Kat.]],2))","v":{"$error":"#N/A"}},null,null,null,"2022-02-15","Abend",{"$f":"INT(H10)+0.75","v":44607.75},{"$f":"VLOOKUP(tSequence[[#This Row],[Datum2]],tData[[Sort]:[Puls]],2,FALSE)","v":{"$error":"#N/A"}},{"$f":"VLOOKUP(tSequence[[#This Row],[Datum2]],tData[[Sort]:[Puls]],3,FALSE)","v":{"$error":"#N/A"}},{"$f":"VLOOKUP(tSequence[[#This Row],[Datum2]],tData[[Sort]:[Puls]],4,FALSE)","v":{"$error":"#N/A"}},null,null,null,null,null,null,null,"Abends",null,null,null,null,null,null,null,null,null,null,null,null,{"$f":"COUNTIF(intermediate!$P$5:$P$25,AH$4)","v":0},{"$f":"COUNTIF(intermediate!$P$5:$P$25,AI$4)","v":0},{"$f":"COUNTIF(intermediate!$P$5:$P$25,AJ$4)","v":0},{"$f":"COUNTIF(intermediate!$P$5:$P$25,AK$4)","v":0},{"$f":"COUNTIF(intermediate!$P$5:$P$25,AL$4)","v":0},{"$f":"COUNTIF(intermediate!$P$5:$P$25,AM$4)","v":0}]
[null,{"$f":"MAX(VLOOKUP(Report_4W!B11,tKategorien[],3),VLOOKUP(Report_4W!C11,tKategorien[[Limit diast. ]:[Kat.]],2))","v":{"$error":"#N/A"}},{"$f":"MAX(VLOOKUP(Report_4W!E11,tKategorien[],3),VLOOKUP(Report_4W!F11,tKategorien[[Limit diast. ]:[Kat.]],2))","v":{"$error":"#N/A"}},{"$f":"MAX(VLOOKUP(Report_4W!H11,tKategorien[],3),VLOOKUP(Report_4W!I11,tKategorien[[Limit diast. ]:[Kat.]],2))","v":{"$error":"#N/A"}},null,null,null,"2022-02-16","Morgen",{"$f":"INT(H11)+0.25","v":44608.25},{"$f":"VLOOKUP(tSequence[[#This Row],[Datum2]],tData[[Sort]:[Puls]],2,FALSE)","v":{"$error":"#N/A"}},{"$f":"VLOOKUP(tSequence[[#This Row],[Datum2]],tData[[Sort]:[Puls]],3,FALSE)","v":{"$error":"#N/A"}},{"$f":"VLOOKUP(tSequence[[#This Row],[Datum2]],tData[[Sort]:[Puls]],4,FALSE)","v":{"$error":"#N/A"}},{"$f":"MAX(VLOOKUP($K11,tKategorien[],3),VLOOKUP($L11,tKategorien[[Limit diast. ]:[Kat.]],2))","v":{"$error":"#N/A"}},{"$f":"MAX(VLOOKUP($K12,tKategorien[],3),VLOOKUP($L12,tKategorien[[Limit diast. ]:[Kat.]],2))","v":{"$error":"#N/A"}},{"$f":"MAX(VLOOKUP($K13,tKategorien[],3),VLOOKUP($L13,tKategorien[[Limit diast. ]:[Kat.]],2))","v":{"$error":"#N/A"}}]
[null,{"$f":"MAX(VLOOKUP(Report_4W!B12,tKategorien[],3),VLOOKUP(Report_4W!C12,tKategorien[[Limit diast. ]:[Kat.]],2))","v":{"$error":"#N/A"}},{"$f":"MAX(VLOOKUP(Report_4W!E12,tKategorien[],3),VLOOKUP(Report_4W!F12,tKategorien[[Limit diast. ]:[Kat.]],2))","v":{"$error":"#N/A"}},{"$f":"MAX(VLOOKUP(Report_4W!H12,tKategorien[],3),VLOOKUP(Report_4W!I12,tKategorien[[Limit diast. ]:[Kat.]],2))","v":{"$error":"#N/A"}},null,null,null,"2022-02-16","Mittag",{"$f":"INT(H12)+0.5","v":44608.5},{"$f":"VLOOKUP(tSequence[[#This Row],[Datum2]],tData[[Sort]:[Puls]],2,FALSE)","v":{"$error":"#N/A"}},{"$f":"VLOOKUP(tSequence[[#This Row],[Datum2]],tData[[Sort]:[Puls]],3,FALSE)","v":{"$error":"#N/A"}},{"$f":"VLOOKUP(tSequence[[#This Row],[Datum2]],tData[[Sort]:[Puls]],4,FALSE)","v":{"$error":"#N/A"}},null,null,null,null,null,null,{"$f":"WEEKNUM(Start_4W,21)+1&\"/\"&YEAR(Start_4W)","v":"8/2022"},"Morgens",{"$f":"COUNTIF(intermediate!$N$26:$N$46,V$4)","v":0},{"$f":"COUNTIF(intermediate!$N$26:$N$46,W$4)","v":0},{"$f":"COUNTIF(intermediate!$N$26:$N$46,X$4)","v":0},{"$f":"COUNTIF(intermediate!$N$26:$N$46,Y$4)","v":0},{"$f":"COUNTIF(intermediate!$N$26:$N$46,Z$4)","v":0},{"$f":"COUNTIF(intermediate!$N$26:$N$46,AA$4)","v":0}]
[null,{"$f":"MAX(VLOOKUP(Report_4W!B13,tKategorien[],3),VLOOKUP(Report_4W!C13,tKategorien[[Limit diast. ]:[Kat.]],2))","v":{"$error":"#N/A"}},{"$f":"MAX(VLOOKUP(Report_4W!E13,tKategorien[],3),VLOOKUP(Report_4W!F13,tKategorien[[Limit diast. ]:[Kat.]],2))","v":{"$error":"#N/A"}},{"$f":"MAX(VLOOKUP(Report_4W!H13,tKategorien[],3),VLOOKUP(Report_4W!I13,tKategorien[[Limit diast. ]:[Kat.]],2))","v":{"$error":"#N/A"}},null,null,null,"2022-02-16","Abend",{"$f":"INT(H13)+0.75","v":44608.75},{"$f":"VLOOKUP(tSequence[[#This Row],[Datum2]],tData[[Sort]:[Puls]],2,FALSE)","v":{"$error":"#N/A"}},{"$f":"VLOOKUP(tSequence[[#This Row],[Datum2]],tData[[Sort]:[Puls]],3,FALSE)","v":{"$error":"#N/A"}},{"$f":"VLOOKUP(tSequence[[#This Row],[Datum2]],tData[[Sort]:[Puls]],4,FALSE)","v":{"$error":"#N/A"}},null,null,null,null,null,null,null,"Mittags",null,null,null,null,null,null,{"$f":"COUNTIF(intermediate!$O$26:$O$46,AB$4)","v":0},{"$f":"COUNTIF(intermediate!$O$26:$O$46,AC$4)","v":0},{"$f":"COUNTIF(intermediate!$O$26:$O$46,AD$4)","v":0},{"$f":"COUNTIF(intermediate!$O$26:$O$46,AE$4)","v":0},{"$f":"COUNTIF(intermediate!$O$26:$O$46,AF$4)","v":0},{"$f":"COUNTIF(intermediate!$O$26:$O$46,AG$4)","v":0}]
[null,{"$f":"MAX(VLOOKUP(Report_4W!B14,tKategorien[],3),VLOOKUP(Report_4W!C14,tKategorien[[Limit diast. ]:[Kat.]],2))","v":{"$error":"#N/A"}},{"$f":"MAX(VLOOKUP(Report_4W!E14,tKategorien[],3),VLOOKUP(Report_4W!F14,tKategorien[[Limit diast. ]:[Kat.]],2))","v":{"$error":"#N/A"}},{"$f":"MAX(VLOOKUP(Report_4W!H14,tKategorien[],3),VLOOKUP(Report_4W!I14,tKategorien[[Limit diast. ]:[Kat.]],2))","v":{"$error":"#N/A"}},null,null,null,"2022-02-17","Morgen",{"$f":"INT(H14)+0.25","v":44609.25},{"$f":"VLOOKUP(tSequence[[#This Row],[Datum2]],tData[[Sort]:[Puls]],2,FALSE)","v":{"$error":"#N/A"}},{"$f":"VLOOKUP(tSequence[[#This Row],[Datum2]],tData[[Sort]:[Puls]],3,FALSE)","v":{"$error":"#N/A"}},{"$f":"VLOOKUP(tSequence[[#This Row],[Datum2]],tData[[Sort]:[Puls]],4,FALSE)","v":{"$error":"#N/A"}},{"$f":"MAX(VLOOKUP($K14,tKategorien[],3),VLOOKUP($L14,tKategorien[[Limit diast. ]:[Kat.]],2))","v":{"$error":"#N/A"}},{"$f":"MAX(VLOOKUP($K15,tKategorien[],3),VLOOKUP($L15,tKategorien[[Limit diast. ]:[Kat.]],2))","v":{"$error":"#N/A"}},{"$f":"MAX(VLOOKUP($K16,tKategorien[],3),VLOOKUP($L16,tKategorien[[Limit diast. ]:[Kat.]],2))","v":{"$error":"#N/A"}},null,null,null,null,"Abends",null,null,null,null,null,null,null,null,null,null,null,null,{"$f":"COUNTIF(intermediate!$P$26:$P$46,AH$4)","v":0},{"$f":"COUNTIF(intermediate!$P$26:$P$46,AI$4)","v":0},{"$f":"COUNTIF(intermediate!$P$26:$P$46,AJ$4)","v":0},{"$f":"COUNTIF(intermediate!$P$26:$P$46,AK$4)","v":0},{"$f":"COUNTIF(intermediate!$P$26:$P$46,AL$4)","v":0},{"$f":"COUNTIF(intermediate!$P$26:$P$46,AM$4)","v":0}]
[null,{"$f":"MAX(VLOOKUP(Report_4W!B15,tKategorien[],3),VLOOKUP(Report_4W!C15,tKategorien[[Limit diast. ]:[Kat.]],2))","v":{"$error":"#N/A"}},{"$f":"MAX(VLOOKUP(Report_4W!E15,tKategorien[],3),VLOOKUP(Report_4W!F15,tKategorien[[Limit diast. ]:[Kat.]],2))","v":{"$error":"#N/A"}},{"$f":"MAX(VLOOKUP(Report_4W!H15,tKategorien[],3),VLOOKUP(Report_4W!I15,tKategorien[[Limit diast. ]:[Kat.]],2))","v":{"$error":"#N/A"}},null,null,null,"2022-02-17","Mittag",{"$f":"INT(H15)+0.5","v":44609.5},{"$f":"VLOOKUP(tSequence[[#This Row],[Datum2]],tData[[Sort]:[Puls]],2,FALSE)","v":{"$error":"#N/A"}},{"$f":"VLOOKUP(tSequence[[#This Row],[Datum2]],tData[[Sort]:[Puls]],3,FALSE)","v":{"$error":"#N/A"}},{"$f":"VLOOKUP(tSequence[[#This Row],[Datum2]],tData[[Sort]:[Puls]],4,FALSE)","v":{"$error":"#N/A"}}]
{"$rows_left_out":320}
{"sheet":"Report_Weight","index":2,"n_rows":232,"n_cols":23,"rows_kept":232,"cut":false,"hidden":true,"merged":[]}
["Gewichtskurve"]
[]
["Startdatum:","2019-10-23",null,"Ausgangsgewicht:",131.80000000000001,"kg","Aktuelles Gewicht:",120.6,"kg"]
[null,null,null,null,null,null,null,null,null,null,"Tag","Veränd_neg","Veränd_pos","Veränderung","Gewicht"]
[null,null,null,null,null,null,null,null,null,null,"2019-10-19",0,null,0,131.80000000000001,null,null,"2019-10-19",43757.25,null,null,null,131.80000000000001]
[null,null,null,null,null,null,null,null,null,null,"2019-10-25",-0.80000000000001137,null,{"$f":"tWeightDaily[[#This Row],[Gewicht]]-Ausgangsgewicht","v":-0.80000000000001137},131,null,null,"2019-10-25",43763.25,null,null,null,131]
[null,null,null,null,null,null,null,null,null,null,"2019-10-26",-0.90000000000000568,-0.90000000000000568,{"$f":"tWeightDaily[[#This Row],[Gewicht]]-Ausgangsgewicht","v":-0.90000000000000568},130.9,null,null,"2019-10-26",43764.25,null,null,null,130.9]
[null,null,null,null,null,null,null,null,null,null,"2019-10-27",-0.30000000000001137,-0.30000000000001137,{"$f":"tWeightDaily[[#This Row],[Gewicht]]-Ausgangsgewicht","v":-0.30000000000001137},131.5,null,null,"2019-10-27",43765.25,null,null,null,131.5]
[null,null,null,null,null,null,null,null,null,null,"2019-10-28",-0.60000000000002274,null,{"$f":"tWeightDaily[[#This Row],[Gewicht]]-Ausgangsgewicht","v":-0.60000000000002274},131.19999999999999,null,null,"2019-10-28",43766.25,null,null,null,131.19999999999999]
[null,null,null,null,null,null,null,null,null,null,"2019-10-29",-0.70000000000001705,null,{"$f":"tWeightDaily[[#This Row],[Gewicht]]-Ausgangsgewicht","v":-0.70000000000001705},131.1,null,null,"2019-10-29",43767.25,null,null,null,131.1]
[null,null,null,null,null,null,null,null,null,null,"2019-10-30",-1.5,-1.5,{"$f":"tWeightDaily[[#This Row],[Gewicht]]-Ausgangsgewicht","v":-1.5},130.30000000000001,null,null,"2019-10-30",43768.25,null,null,null,130.30000000000001]
[null,null,null,null,null,null,null,null,null,null,"2019-10-31",null,-1.4000000000000057,{"$f":"tWeightDaily[[#This Row],[Gewicht]]-Ausgangsgewicht","v":-1.4000000000000057},130.4,null,null,"2019-10-31",43769.25,null,null,null,130.4]
[null,null,null,null,null,null,null,null,null,null,"2019-11-01",-0.40000000000000568,-0.40000000000000568,{"$f":"tWeightDaily[[#This Row],[Gewicht]]-Ausgangsgewicht","v":-0.40000000000000568},131.4,null,null,"2019-11-01",43770.25,null,null,null,131.4]
[null,null,null,null,null,null,null,null,null,null,"2019-11-02",-0.70000000000001705,-0.70000000000001705,{"$f":"tWeightDaily[[#This Row],[Gewicht]]-Ausgangsgewicht","v":-0.70000000000001705},131.1,null,null,"2019-11-02",43771.25,null,null,null,131.1]
[null,null,null,null,null,null,null,null,null,null,"2019-11-03",0,0,{"$f":"tWeightDaily[[#This Row],[Gewicht]]-Ausgangsgewicht","v":0},131.80000000000001,null,null,"2019-11-03",43772.25,null,null,null,131.80000000000001]
{"$rows_left_out":218}
{"sheet":"Report_Gew90Tage","index":3,"n_rows":4,"n_cols":10,"rows_kept":4,"cut":false,"hidden":true,"merged":[[0,4,0,5],[0,18,0,20]]}
["Name: ",{"$f":"Nachname&\", \"&Vorname","v":", "},null,"Geburtsdatum: ",{"$f":"Geburtsdatum","v":"00:00:00"},null,"Betrachtungszeitraum:",null,null,"12. Apr. 2020 - 11. Jul. 2020"]
["Gewicht der letzten 90 Tage (Verlaufsdokumentation)"]
[]
["Min. Gewicht:",119.6,"kg","Max. Gewicht:",122.8,"kg",null,"Aktuelles Gewicht:",120.1,"kg"]

{"sheet":"Report_GewJahr","index":4,"n_rows":58,"n_cols":16,"rows_kept":58,"cut":false,"hidden":true,"merged":[[0,4,0,5],[0,19,0,21]]}
["Name: ",{"$f":"Nachname&\", \"&Vorname","v":", "},null,"Geburtsdatum: ",{"$f":"Geburtsdatum","v":"00:00:00"},null,"Betrachtungszeitraum:",null,null,"19. Okt. 2019 - 11. Jul. 2020"]
["Gewicht (Verlaufsdokumentation, wöchentliche Mittelwerte)"]
[]
[]
[null,null,null,null,null,null,null,null,null,null,null,null,null,"Woche","2020","2019"]
[null,null,null,null,null,null,null,null,null,null,null,null,null,1,128]
[null,null,null,null,null,null,null,null,null,null,null,null,null,2,126.05]
[null,null,null,null,null,null,null,null,null,null,null,null,null,3,124]
[null,null,null,null,null,null,null,null,null,null,null,null,null,4,123.94285714285715]
[null,null,null,null,null,null,null,null,null,null,null,null,null,5,123.85000000000001]
[null,null,null,null,null,null,null,null,null,null,null,null,null,6,124.48333333333333]
[null,null,null,null,null,null,null,null,null,null,null,null,null,7,124.17142857142858]
[null,null,null,null,null,null,null,null,null,null,null,null,null,8,124.23333333333335]
[null,null,null,null,null,null,null,null,null,null,null,null,null,9,123.67142857142856]
[null,null,null,null,null,null,null,null,null,null,null,null,null,10,123.88]
{"$rows_left_out":44}
{"sheet":"Report_GewReduktion","index":5,"n_rows":47,"n_cols":27,"rows_kept":47,"cut":false,"hidden":true,"merged":[[0,17,0,19],[0,4,0,5]]}
["Name: ",{"$f":"Nachname&\", \"&Vorname","v":", "},null,"Geburtsdatum: ",{"$f":"Geburtsdatum","v":"00:00:00"},null,null,null,"Betrachtungszeitraum:",null,null,null,"19. Okt. 2019 - 11. Jul. 2020"]
["Gewichtsreduzierung (wöchentlicher Stichtagswert)"]
[]
["Startdatum:","2019-10-23",null,null,null,"Ausgangsgewicht:",131.80000000000001,"kg",null,"Ausgangs-BMI:",{"$f":"Ausgangsgewicht/(Körpergröße*Körpergröße/10000)","v":{"$error":"#DIV/0!"}},"kg/m²"]
[]
["Wiegetag:","1900-01-07",null,null,null,"Aktuelles Gewicht:",120.1,"kg",null,"Aktueller BMI:",{"$f":"Aktuelles_Gewicht/(Körpergröße*Körpergröße/10000)","v":{"$error":"#DIV/0!"}},"kg/m²"]
[null,null,null,null,null,null,null,null,null,null,null,null,null,null,{"$f":"COLUMN()","v":15},{"$f":"COLUMN()","v":16},{"$f":"COLUMN()","v":17},{"$f":"COLUMN()","v":18},{"$f":"COLUMN()","v":19}]
[null,null,null,null,null,null,null,null,null,null,null,null,null,null,"Tag","Veränd_neg","Veränd_pos","Veränderung","Gewicht","Untergewicht","Normalgewicht","Leichtes Übergew.","Übergewicht",null,null,null,{"$f":"getvalue(MIN(ROW(tWeightWeekly[]))+ROWS(tWeightWeekly[])-1, 18)/((getvalue(MIN(ROW(tWeightWeekly[]))+ROWS(tWeightWeekly[])-1, 15)-getvalue(MIN(ROW(tWeightWeekly[])), 15))/30)","v":{"$error":"#DIV/0!"}}]
[null,null,null,null,null,null,null,null,null,null,null,null,null,null,"2019-10-19",{"$f":"tWeightWeekly[[#This Row],[Gewicht]]-Ausgangsgewicht","v":0},null,0,131.80000000000001,-74.483200000000011,-20.313599999999994,-13.542400000000001,-23.460800000000006]
[null,null,null,null,null,null,null,null,null,null,null,null,null,null,"2019-10-26",{"$f":"tWeightWeekly[[#This Row],[Gewicht]]-Ausgangsgewicht","v":-0.90000000000000568},{"$f":"tWeightWeekly[[#This Row],[Gewicht]]-Ausgangsgewicht","v":-0.90000000000000568},{"$f":"tWeightWeekly[[#This Row],[Gewicht]]-Ausgangsgewicht","v":-0.90000000000000568},130.9,-74.483200000000011,-20.313599999999994,-13.542400000000001,-23.460800000000006]
[null,null,null,null,null,null,null,null,null,null,null,null,null,null,"2019-11-02",{"$f":"tWeightWeekly[[#This Row],[Gewicht]]-Ausgangsgewicht","v":-0.70000000000001705},{"$f":"tWeightWeekly[[#This Row],[Gewicht]]-Ausgangsgewicht","v":-0.70000000000001705},{"$f":"tWeightWeekly[[#This Row],[Gewicht]]-Ausgangsgewicht","v":-0.70000000000001705},131.1,-74.483200000000011,-20.313599999999994,-13.542400000000001,-23.460800000000006]
[null,null,null,null,null,null,null,null,null,null,null,null,null,null,"2019-11-09",{"$f":"tWeightWeekly[[#This Row],[Gewicht]]-Ausgangsgewicht","v":-0.70000000000001705},null,{"$f":"tWeightWeekly[[#This Row],[Gewicht]]-Ausgangsgewicht","v":-0.70000000000001705},131.1,-74.483200000000011,-20.313599999999994,-13.542400000000001,-23.460800000000006]
[null,null,null,null,null,null,null,null,null,null,null,null,null,null,"2019-11-16",{"$f":"tWeightWeekly[[#This Row],[Gewicht]]-Ausgangsgewicht","v":-1},null,{"$f":"tWeightWeekly[[#This Row],[Gewicht]]-Ausgangsgewicht","v":-1},130.80000000000001,-74.483200000000011,-20.313599999999994,-13.542400000000001,-23.460800000000006]
[null,null,null,null,null,null,null,null,null,null,null,null,null,null,"2019-11-23",{"$f":"tWeightWeekly[[#This Row],[Gewicht]]-Ausgangsgewicht","v":-1.5},null,{"$f":"tWeightWeekly[[#This Row],[Gewicht]]-Ausgangsgewicht","v":-1.5},130.30000000000001,-74.483200000000011,-20.313599999999994,-13.542400000000001,-23.460800000000006]
[null,null,null,null,null,null,null,null,null,null,null,null,null,null,"2019-11-30",{"$f":"tWeightWeekly[[#This Row],[Gewicht]]-Ausgangsgewicht","v":-1.9000000000000057},null,{"$f":"tWeightWeekly[[#This Row],[Gewicht]]-Ausgangsgewicht","v":-1.9000000000000057},129.9,-74.483200000000011,-20.313599999999994,-13.542400000000001,-23.460800000000006]
{"$rows_left_out":33}
{"sheet":"data","index":6,"n_rows":2,"n_cols":8,"rows_kept":2,"cut":false,"hidden":true,"merged":[]}
["Datum1","Tageszeit","Sort","Systolisch","Diastolisch","Puls","Gewicht","Bemerkung"]
[null,null,{"$f":"tData[[#This Row],[Datum1]]+_xlfn.IFNA(VLOOKUP(tData[[#This Row],[Tageszeit]],tTageszeit[],3,FALSE), 0)","v":0}]

{"sheet":"settings","index":7,"n_rows":36,"n_cols":17,"rows_kept":36,"cut":false,"hidden":true,"merged":[]}
[]
[null,null,null,null,null,"Blutdruck-Grenzwerte",null,null,null,null,null,null,null,null,"Wochentage"]
[null,"Tageszeit","Index","Zeitwert",null,"Limit syst.","Limit diast. ","Kat.",null,"Bedeutung","Wert","Default","Demo",null,"Datum","Text"]
[null,"Morgen",1,0.25,null,1,1,1,null,"Letzter Wert vom:",{"$f":"MAX(tData[Datum1])","v":"00:00:00"},{"$f":"MAX(tData[Datum1])","v":"00:00:00"},null,null,"1900-01-01",{"$f":"TEXT(O4, \"TTTT\")","v":"Sonntag"}]
[null,"Mittag",2,0.5,null,90,60,2,null,"Kalenderwoche:",{"$f":"WEEKNUM(K4,21)&\"/\"&YEAR(K4)","v":"52/1900"},null,null,null,"1900-01-02",{"$f":"TEXT(O5, \"TTTT\")","v":"Montag"}]
[null,"Abend",3,0.75,null,120,80,3,null,"4W_Start:","2022-02-14",{"$f":"$K4-WEEKDAY($K4,3)-21","v":-26},null,null,"1900-01-03","Dienstag"]
[null,null,null,null,null,140,90,4,null,"Nachname:",null,null,null,null,"1900-01-04","Mittwoch"]
[null,null,null,null,null,160,100,5,null,"Vorname:",null,null,null,null,"1900-01-05","Donnerstag"]
[null,null,null,null,null,180,110,6,null,"Geburtsdatum:",null,null,null,null,"1900-01-06","Freitag"]
[null,null,null,null,null,null,null,null,null,"Mittagswerte verw.:",1,1,null,null,"1900-01-07","Samstag"]
[null,null,null,null,null,null,null,null,null,"Geschlecht","m","m"]
[null,null,null,null,null,null,null,null,null,"Körpergröße",0,0]
[null,null,null,null,null,null,null,null,null,"Eingabedialog b. Start",0,0]
[null,null,null,null,null,null,null,null,null,"DebugMode",false,false]
[null,"BMI-Tabelle nach Geschlecht & Alter"]
{"$rows_left_out":21}