{"text_format":"1","workbook":"xlsx","n_sheets":4,"sheets":["Report_4W","intermediate","data","settings"],"not_rendered":{"charts":3,"images":1,"macros":1,"external_links":0,"defined_names":10,"comments":0,"pivot_tables":0},"unopened":[],"bounds":{"document_bytes":16777216,"sheet_cells":100000,"rows_first":2000,"rows_last":500,"rows_between":2000,"halvings":0,"cell_chars":16384,"cell_head_chars":4096},"cells_cut":0,"cells_raw":0,"read":"whole","date_system":"1900"}

{"sheet":"Report_4W","index":0,"n_rows":14,"n_cols":28,"rows_kept":14,"cut":false,"hidden":false,"merged":[[0,16,0,18],[2,1,2,3],[2,7,2,9],[0,22,0,23],[2,4,2,6],[0,11,0,12]]}
["Name: ",{"$f":"Nachname&\", \"&Vorname","v":", "},null,null,null,null,null,null,null,"Geburstdatum: ",null,{"$f":"Geburtsdatum","v":"00:00:00"},null,null,null,null,null,null,null,null,null,"Betrachtungszeitraum:",{"$f":"TEXT(MIN(tDatumswerte),\"tt. MMM.\")&\" - \"&TEXT(MAX(tDatumswerte),\"tt. MMM.jjjj\")","v":"00. Jan. - 00. Jan.1900"}]
[]
[null,"Morgens ",null,null,"Mittags ",null,null,"Abends "]
["Datum","Syst.","Diast.","Puls","Syst.","Diast.","Puls","Syst.","Diast.","Puls"]
[]
[]
[]
[]
[]
[]
[]
[]
[]
[null,null,null,null,null,null,null,null,null,null,null,null,null,null,null,null,null,null,null,null,null,null,null,null,null,null,null,"─"]

{"sheet":"intermediate","index":1,"n_rows":88,"n_cols":39,"rows_kept":88,"cut":false,"hidden":true,"merged":[]}
[]
[null,"4W-Datentabelle: Max. Kategorie"]
[]
[null,"Morgens","Mittags","Abends",null,null,null,"Datum1","Tageszeit","Datum2","Syst.","Diast.","Puls","Kat_Morgen","Kat_Mittag","Kat_Abend",null,null,null,null,null,1,2,3,4,5,6,1,2,3,4,5,6,1,2,3,4,5,6]
[null,{"$f":"MAX(VLOOKUP(Report_4W!B5,tKategorien[],3),VLOOKUP(Report_4W!C5,tKategorien[[Limit diast. ]:[Kat.]],2))","v":{"$error":"#N/A"}},{"$f":"MAX(VLOOKUP(Report_4W!E5,tKategorien[],3),VLOOKUP(Report_4W!F5,tKategorien[[Limit diast. ]:[Kat.]],2))","v":{"$error":"#N/A"}},{"$f":"MAX(VLOOKUP(Report_4W!H5,tKategorien[],3),VLOOKUP(Report_4W!I5,tKategorien[[Limit diast. ]:[Kat.]],2))","v":{"$error":"#N/A"}},null,null,null,{"$f":"Start_4W","v":"2019-04-22"},"Morgen",{"$f":"INT(H5)+0.25","v":43577.25},{"$f":"VLOOKUP(tSequence[[#This Row],[Datum2]],tData[[Sort]:[Puls]],2,FALSE)","v":{"$error":"#N/A"}},{"$f":"VLOOKUP(tSequence[[#This Row],[Datum2]],tData[[Sort]:[Puls]],3,FALSE)","v":{"$error":"#N/A"}},{"$f":"VLOOKUP(tSequence[[#This Row],[Datum2]],tData[[Sort]:[Puls]],4,FALSE)","v":{"$error":"#N/A"}},{"$f":"MAX(VLOOKUP($K5,tKategorien[],3),VLOOKUP($L5,tKategorien[[Limit diast. ]:[Kat.]],2))","v":{"$error":"#N/A"}},{"$f":"MAX(VLOOKUP($K6,tKategorien[],3),VLOOKUP($L6,tKategorien[[Limit diast. ]:[Kat.]],2))","v":{"$error":"#N/A"}},{"$f":"MAX(VLOOKUP($K7,tKategorien[],3),VLOOKUP($L7,tKategorien[[Limit diast. ]:[Kat.]],2))","v":{"$error":"#N/A"}},null,null,null,null,null,"Morgens","Morgens","Morgens","Morgens","Morgens","Morgens","Mittags","Mittags","Mittags","Mittags","Mittags","Mittags","Abends","Abends","Abends","Abends","Abends","Abends"]
[null,{"$f":"MAX(VLOOKUP(Report_4W!B6,tKategorien[],3),VLOOKUP(Report_4W!C6,tKategorien[[Limit diast. ]:[Kat.]],2))","v":{"$error":"#N/A"}},{"$f":"MAX(VLOOKUP(Report_4W!E6,tKategorien[],3),VLOOKUP(Report_4W!F6,tKategorien[[Limit diast. ]:[Kat.]],2))","v":{"$error":"#N/A"}},{"$f":"MAX(VLOOKUP(Report_4W!H6,tKategorien[],3),VLOOKUP(Report_4W!I6,tKategorien[[Limit diast. ]:[Kat.]],2))","v":{"$error":"#N/A"}},null,null,null,{"$f":"INT($H$5+(ROW()-5)/3)","v":"2019-04-22"},"Mittag",{"$f":"INT(H6)+0.5","v":43577.5},{"$f":"VLOOKUP(tSequence[[#This Row],[Datum2]],tData[[Sort]:[Puls]],2,FALSE)","v":{"$error":"#N/A"}},{"$f":"VLOOKUP(tSequence[[#This Row],[Datum2]],tData[[Sort]:[Puls]],3,FALSE)","v":{"$error":"#N/A"}},{"$f":"VLOOKUP(tSequence[[#This Row],[Datum2]],tData[[Sort]:[Puls]],4,FALSE)","v":{"$error":"#N/A"}},null,null,null,null,null,null,null,null,"Kat.1","Kat.2","Kat.3","Kat.4","Kat.5","Kat.6","Kat.1","Kat.2","Kat.3","Kat.4","Kat.5","Kat.6","Kat.1","Kat.2","Kat.3","Kat.4","Kat.5","Kat.6"]
[null,{"$f":"MAX(VLOOKUP(Report_4W!B7,tKategorien[],3),VLOOKUP(Report_4W!C7,tKategorien[[Limit diast. ]:[Kat.]],2))","v":{"$error":"#N/A"}},{"$f":"MAX(VLOOKUP(Report_4W!E7,tKategorien[],3),VLOOKUP(Report_4W!F7,tKategorien[[Limit diast. ]:[Kat.]],2))","v":{"$error":"#N/A"}},{"$f":"MAX(VLOOKUP(Report_4W!H7,tKategorien[],3),VLOOKUP(Report_4W!I7,tKategorien[[Limit diast. ]:[Kat.]],2))","v":{"$error":"#N/A"}},null,null,null,"2019-04-22","Abend",{"$f":"INT(H7)+0.75","v":43577.75},{"$f":"VLOOKUP(tSequence[[#This Row],[Datum2]],tData[[Sort]:[Puls]],2,FALSE)","v":{"$error":"#N/A"}},{"$f":"VLOOKUP(tSequence[[#This Row],[Datum2]],tData[[Sort]:[Puls]],3,FALSE)","v":{"$error":"#N/A"}},{"$f":"VLOOKUP(tSequence[[#This Row],[Datum2]],tData[[Sort]:[Puls]],4,FALSE)","v":{"$error":"#N/A"}}]
[null,{"$f":"MAX(VLOOKUP(Report_4W!B8,tKategorien[],3),VLOOKUP(Report_4W!C8,tKategorien[[Limit diast. ]:[Kat.]],2))","v":{"$error":"#N/A"}},{"$f":"MAX(VLOOKUP(Report_4W!E8,tKategorien[],3),VLOOKUP(Report_4W!F8,tKategorien[[Limit diast. ]:[Kat.]],2))","v":{"$error":"#N/A"}},{"$f":"MAX(VLOOKUP(Report_4W!H8,tKategorien[],3),VLOOKUP(Report_4W!I8,tKategorien[[Limit diast. ]:[Kat.]],2))","v":{"$error":"#N/A"}},null,null,null,"2019-04-23","Morgen",{"$f":"INT(H8)+0.25","v":43578.25},{"$f":"VLOOKUP(tSequence[[#This Row],[Datum2]],tData[[Sort]:[Puls]],2,FALSE)","v":{"$error":"#N/A"}},{"$f":"VLOOKUP(tSequence[[#This Row],[Datum2]],tData[[Sort]:[Puls]],3,FALSE)","v":{"$error":"#N/A"}},{"$f":"VLOOKUP(tSequence[[#This Row],[Datum2]],tData[[Sort]:[Puls]],4,FALSE)","v":{"$error":"#N/A"}},{"$f":"MAX(VLOOKUP($K8,tKategorien[],3),VLOOKUP($L8,tKategorien[[Limit diast. ]:[Kat.]],2))","v":{"$error":"#N/A"}},{"$f":"MAX(VLOOKUP($K9,tKategorien[],3),VLOOKUP($L9,tKategorien[[Limit diast. ]:[Kat.]],2))","v":{"$error":"#N/A"}},{"$f":"MAX(VLOOKUP($K10,tKategorien[],3),VLOOKUP($L10,tKategorien[[Limit diast. ]:[Kat.]],2))","v":{"$error":"#N/A"}},null,null,null,{"$f":"WEEKNUM(Start_4W,21)&\"/\"&YEAR(Start_4W)","v":"17/2019"},"Morgens",{"$f":"COUNTIF(intermediate!$N$5:$N$25,V$4)","v":0},{"$f":"COUNTIF(intermediate!$N$5:$N$25,W$4)","v":0},{"$f":"COUNTIF(intermediate!$N$5:$N$25,X$4)","v":0},{"$f":"COUNTIF(intermediate!$N$5:$N$25,Y$4)","v":0},{"$f":"COUNTIF(intermediate!$N$5:$N$25,Z$4)","v":0},{"$f":"COUNTIF(intermediate!$N$5:$N$25,AA$4)","v":0}]
[null,{"$f":"MAX(VLOOKUP(Report_4W!B9,tKategorien[],3),VLOOKUP(Report_4W!C9,tKategorien[[Limit diast. ]:[Kat.]],2))","v":{"$error":"#N/A"}},{"$f":"MAX(VLOOKUP(Report_4W!E9,tKategorien[],3),VLOOKUP(Report_4W!F9,tKategorien[[Limit diast. ]:[Kat.]],2))","v":{"$error":"#N/A"}},{"$f":"MAX(VLOOKUP(Report_4W!H9,tKategorien[],3),VLOOKUP(Report_4W!I9,tKategorien[[Limit diast. ]:[Kat.]],2))","v":{"$error":"#N/A"}},null,null,null,"2019-04-23","Mittag",{"$f":"INT(H9)+0.5","v":43578.5},{"$f":"VLOOKUP(tSequence[[#This Row],[Datum2]],tData[[Sort]:[Puls]],2,FALSE)","v":{"$error":"#N/A"}},{"$f":"VLOOKUP(tSequence[[#This Row],[Datum2]],tData[[Sort]:[Puls]],3,FALSE)","v":{"$error":"#N/A"}},{"$f":"VLOOKUP(tSequence[[#This Row],[Datum2]],tData[[Sort]:[Puls]],4,FALSE)","v":{"$error":"#N/A"}},null,null,null,null,null,null,null,"Mittags",null,null,null,null,null,null,{"$f":"COUNTIF(intermediate!$O$5:$O$25,AB$4)","v":0},{"$f":"COUNTIF(intermediate!$O$5:$O$25,AC$4)","v":0},{"$f":"COUNTIF(intermediate!$O$5:$O$25,AD$4)","v":0},{"$f":"COUNTIF(intermediate!$O$5:$O$25,AE$4)","v":0},{"$f":"COUNTIF(intermediate!$O$5:$O$25,AF$4)","v":0},{"$f":"COUNTIF(intermediate!$O$5:$O$25,AG$4)","v":0}]
[null,{"$f":"MAX(VLOOKUP(Report_4W!B10,tKategorien[],3),VLOOKUP(Report_4W!C10,tKategorien[[Limit diast. ]:[Kat.]],2))","v":{"$error":"#N/A"}},{"$f":"MAX(VLOOKUP(Report_4W!E10,tKategorien[],3),VLOOKUP(Report_4W!F10,tKategorien[[Limit diast. ]:[Kat.]],2))","v":{"$error":"#N/A"}},{"$f":"MAX(VLOOKUP(Report_4W!H10,tKategorien[],3),VLOOKUP(Report_4W!I10,tKategorien[[Limit diast. ]:[Kat.]],2))","v":{"$error":"#N/A"}},null,null,null,"2019-04-23","Abend",{"$f":"INT(H10)+0.75","v":43578.75},{"$f":"VLOOKUP(tSequence[[#This Row],[Datum2]],tData[[Sort]:[Puls]],2,FALSE)","v":{"$error":"#N/A"}},{"$f":"VLOOKUP(tSequence[[#This Row],[Datum2]],tData[[Sort]:[Puls]],3,FALSE)","v":{"$error":"#N/A"}},{"$f":"VLOOKUP(tSequence[[#This Row],[Datum2]],tData[[Sort]:[Puls]],4,FALSE)","v":{"$error":"#N/A"}},null,null,null,null,null,null,null,"Abends",null,null,null,null,null,null,null,null,null,null,null,null,{"$f":"COUNTIF(intermediate!$P$5:$P$25,AH$4)","v":0},{"$f":"COUNTIF(intermediate!$P$5:$P$25,AI$4)","v":0},{"$f":"COUNTIF(intermediate!$P$5:$P$25,AJ$4)","v":0},{"$f":"COUNTIF(intermediate!$P$5:$P$25,AK$4)","v":0},{"$f":"COUNTIF(intermediate!$P$5:$P$25,AL$4)","v":0},{"$f":"COUNTIF(intermediate!$P$5:$P$25,AM$4)","v":0}]
[null,{"$f":"MAX(VLOOKUP(Report_4W!B11,tKategorien[],3),VLOOKUP(Report_4W!C11,tKategorien[[Limit diast. ]:[Kat.]],2))","v":{"$error":"#N/A"}},{"$f":"MAX(VLOOKUP(Report_4W!E11,tKategorien[],3),VLOOKUP(Report_4W!F11,tKategorien[[Limit diast. ]:[Kat.]],2))","v":{"$error":"#N/A"}},{"$f":"MAX(VLOOKUP(Report_4W!H11,tKategorien[],3),VLOOKUP(Report_4W!I11,tKategorien[[Limit diast. ]:[Kat.]],2))","v":{"$error":"#N/A"}},null,null,null,"2019-04-24","Morgen",{"$f":"INT(H11)+0.25","v":43579.25},{"$f":"VLOOKUP(tSequence[[#This Row],[Datum2]],tData[[Sort]:[Puls]],2,FALSE)","v":{"$error":"#N/A"}},{"$f":"VLOOKUP(tSequence[[#This Row],[Datum2]],tData[[Sort]:[Puls]],3,FALSE)","v":{"$error":"#N/A"}},{"$f":"VLOOKUP(tSequence[[#This Row],[Datum2]],tData[[Sort]:[Puls]],4,FALSE)","v":{"$error":"#N/A"}},{"$f":"MAX(VLOOKUP($K11,tKategorien[],3),VLOOKUP($L11,tKategorien[[Limit diast. ]:[Kat.]],2))","v":{"$error":"#N/A"}},{"$f":"MAX(VLOOKUP($K12,tKategorien[],3),VLOOKUP($L12,tKategorien[[Limit diast. ]:[Kat.]],2))","v":{"$error":"#N/A"}},{"$f":"MAX(VLOOKUP($K13,tKategorien[],3),VLOOKUP($L13,tKategorien[[Limit diast. ]:[Kat.]],2))","v":{"$error":"#N/A"}}]
[null,{"$f":"MAX(VLOOKUP(Report_4W!B12,tKategorien[],3),VLOOKUP(Report_4W!C12,tKategorien[[Limit diast. ]:[Kat.]],2))","v":{"$error":"#N/A"}},{"$f":"MAX(VLOOKUP(Report_4W!E12,tKategorien[],3),VLOOKUP(Report_4W!F12,tKategorien[[Limit diast. ]:[Kat.]],2))","v":{"$error":"#N/A"}},{"$f":"MAX(VLOOKUP(Report_4W!H12,tKategorien[],3),VLOOKUP(Report_4W!I12,tKategorien[[Limit diast. ]:[Kat.]],2))","v":{"$error":"#N/A"}},null,null,null,"2019-04-24","Mittag",{"$f":"INT(H12)+0.5","v":43579.5},{"$f":"VLOOKUP(tSequence[[#This Row],[Datum2]],tData[[Sort]:[Puls]],2,FALSE)","v":{"$error":"#N/A"}},{"$f":"VLOOKUP(tSequence[[#This Row],[Datum2]],tData[[Sort]:[Puls]],3,FALSE)","v":{"$error":"#N/A"}},{"$f":"VLOOKUP(tSequence[[#This Row],[Datum2]],tData[[Sort]:[Puls]],4,FALSE)","v":{"$error":"#N/A"}},null,null,null,null,null,null,{"$f":"WEEKNUM(Start_4W,21)+1&\"/\"&YEAR(Start_4W)","v":"18/2019"},"Morgens",{"$f":"COUNTIF(intermediate!$N$26:$N$46,V$4)","v":0},{"$f":"COUNTIF(intermediate!$N$26:$N$46,W$4)","v":0},{"$f":"COUNTIF(intermediate!$N$26:$N$46,X$4)","v":0},{"$f":"COUNTIF(intermediate!$N$26:$N$46,Y$4)","v":0},{"$f":"COUNTIF(intermediate!$N$26:$N$46,Z$4)","v":0},{"$f":"COUNTIF(intermediate!$N$26:$N$46,AA$4)","v":0}]
[null,{"$f":"MAX(VLOOKUP(Report_4W!B13,tKategorien[],3),VLOOKUP(Report_4W!C13,tKategorien[[Limit diast. ]:[Kat.]],2))","v":{"$error":"#N/A"}},{"$f":"MAX(VLOOKUP(Report_4W!E13,tKategorien[],3),VLOOKUP(Report_4W!F13,tKategorien[[Limit diast. ]:[Kat.]],2))","v":{"$error":"#N/A"}},{"$f":"MAX(VLOOKUP(Report_4W!H13,tKategorien[],3),VLOOKUP(Report_4W!I13,tKategorien[[Limit diast. ]:[Kat.]],2))","v":{"$error":"#N/A"}},null,null,null,"2019-04-24","Abend",{"$f":"INT(H13)+0.75","v":43579.75},{"$f":"VLOOKUP(tSequence[[#This Row],[Datum2]],tData[[Sort]:[Puls]],2,FALSE)","v":{"$error":"#N/A"}},{"$f":"VLOOKUP(tSequence[[#This Row],[Datum2]],tData[[Sort]:[Puls]],3,FALSE)","v":{"$error":"#N/A"}},{"$f":"VLOOKUP(tSequence[[#This Row],[Datum2]],tData[[Sort]:[Puls]],4,FALSE)","v":{"$error":"#N/A"}},null,null,null,null,null,null,null,"Mittags",null,null,null,null,null,null,{"$f":"COUNTIF(intermediate!$O$26:$O$46,AB$4)","v":0},{"$f":"COUNTIF(intermediate!$O$26:$O$46,AC$4)","v":0},{"$f":"COUNTIF(intermediate!$O$26:$O$46,AD$4)","v":0},{"$f":"COUNTIF(intermediate!$O$26:$O$46,AE$4)","v":0},{"$f":"COUNTIF(intermediate!$O$26:$O$46,AF$4)","v":0},{"$f":"COUNTIF(intermediate!$O$26:$O$46,AG$4)","v":0}]
[null,{"$f":"MAX(VLOOKUP(Report_4W!B14,tKategorien[],3),VLOOKUP(Report_4W!C14,tKategorien[[Limit diast. ]:[Kat.]],2))","v":{"$error":"#N/A"}},{"$f":"MAX(VLOOKUP(Report_4W!E14,tKategorien[],3),VLOOKUP(Report_4W!F14,tKategorien[[Limit diast. ]:[Kat.]],2))","v":{"$error":"#N/A"}},{"$f":"MAX(VLOOKUP(Report_4W!H14,tKategorien[],3),VLOOKUP(Report_4W!I14,tKategorien[[Limit diast. ]:[Kat.]],2))","v":{"$error":"#N/A"}},null,null,null,"2019-04-25","Morgen",{"$f":"INT(H14)+0.25","v":43580.25},{"$f":"VLOOKUP(tSequence[[#This Row],[Datum2]],tData[[Sort]:[Puls]],2,FALSE)","v":{"$error":"#N/A"}},{"$f":"VLOOKUP(tSequence[[#This Row],[Datum2]],tData[[Sort]:[Puls]],3,FALSE)","v":{"$error":"#N/A"}},{"$f":"VLOOKUP(tSequence[[#This Row],[Datum2]],tData[[Sort]:[Puls]],4,FALSE)","v":{"$error":"#N/A"}},{"$f":"MAX(VLOOKUP($K14,tKategorien[],3),VLOOKUP($L14,tKategorien[[Limit diast. ]:[Kat.]],2))","v":{"$error":"#N/A"}},{"$f":"MAX(VLOOKUP($K15,tKategorien[],3),VLOOKUP($L15,tKategorien[[Limit diast. ]:[Kat.]],2))","v":{"$error":"#N/A"}},{"$f":"MAX(VLOOKUP($K16,tKategorien[],3),VLOOKUP($L16,tKategorien[[Limit diast. ]:[Kat.]],2))","v":{"$error":"#N/A"}},null,null,null,null,"Abends",null,null,null,null,null,null,null,null,null,null,null,null,{"$f":"COUNTIF(intermediate!$P$26:$P$46,AH$4)","v":0},{"$f":"COUNTIF(intermediate!$P$26:$P$46,AI$4)","v":0},{"$f":"COUNTIF(intermediate!$P$26:$P$46,AJ$4)","v":0},{"$f":"COUNTIF(intermediate!$P$26:$P$46,AK$4)","v":0},{"$f":"COUNTIF(intermediate!$P$26:$P$46,AL$4)","v":0},{"$f":"COUNTIF(intermediate!$P$26:$P$46,AM$4)","v":0}]
[null,{"$f":"MAX(VLOOKUP(Report_4W!B15,tKategorien[],3),VLOOKUP(Report_4W!C15,tKategorien[[Limit diast. ]:[Kat.]],2))","v":{"$error":"#N/A"}},{"$f":"MAX(VLOOKUP(Report_4W!E15,tKategorien[],3),VLOOKUP(Report_4W!F15,tKategorien[[Limit diast. ]:[Kat.]],2))","v":{"$error":"#N/A"}},{"$f":"MAX(VLOOKUP(Report_4W!H15,tKategorien[],3),VLOOKUP(Report_4W!I15,tKategorien[[Limit diast. ]:[Kat.]],2))","v":{"$error":"#N/A"}},null,null,null,"2019-04-25","Mittag",{"$f":"INT(H15)+0.5","v":43580.5},{"$f":"VLOOKUP(tSequence[[#This Row],[Datum2]],tData[[Sort]:[Puls]],2,FALSE)","v":{"$error":"#N/A"}},{"$f":"VLOOKUP(tSequence[[#This Row],[Datum2]],tData[[Sort]:[Puls]],3,FALSE)","v":{"$error":"#N/A"}},{"$f":"VLOOKUP(tSequence[[#This Row],[Datum2]],tData[[Sort]:[Puls]],4,FALSE)","v":{"$error":"#N/A"}}]
[null,{"$f":"MAX(VLOOKUP(Report_4W!B16,tKategorien[],3),VLOOKUP(Report_4W!C16,tKategorien[[Limit diast. ]:[Kat.]],2))","v":{"$error":"#N/A"}},{"$f":"MAX(VLOOKUP(Report_4W!E16,tKategorien[],3),VLOOKUP(Report_4W!F16,tKategorien[[Limit diast. ]:[Kat.]],2))","v":{"$error":"#N/A"}},{"$f":"MAX(VLOOKUP(Report_4W!H16,tKategorien[],3),VLOOKUP(Report_4W!I16,tKategorien[[Limit diast. ]:[Kat.]],2))","v":{"$error":"#N/A"}},null,null,null,"2019-04-25","Abend",{"$f":"INT(H16)+0.75","v":43580.75},{"$f":"VLOOKUP(tSequence[[#This Row],[Datum2]],tData[[Sort]:[Puls]],2,FALSE)","v":{"$error":"#N/A"}},{"$f":"VLOOKUP(tSequence[[#This Row],[Datum2]],tData[[Sort]:[Puls]],3,FALSE)","v":{"$error":"#N/A"}},{"$f":"VLOOKUP(tSequence[[#This Row],[Datum2]],tData[[Sort]:[Puls]],4,FALSE)","v":{"$error":"#N/A"}},null,null,null,null,null,null,{"$f":"WEEKNUM(Start_4W,21)+2&\"/\"&YEAR(Start_4W)","v":"19/2019"},"Morgens",{"$f":"COUNTIF(intermediate!$N$47:$N$67,V$4)","v":0},{"$f":"COUNTIF(intermediate!$N$47:$N$67,W$4)","v":0},{"$f":"COUNTIF(intermediate!$N$47:$N$67,X$4)","v":0},{"$f":"COUNTIF(intermediate!$N$47:$N$67,Y$4)","v":0},{"$f":"COUNTIF(intermediate!$N$47:$N$67,Z$4)","v":0},{"$f":"COUNTIF(intermediate!$N$47:$N$67,AA$4)","v":0}]
[null,{"$f":"MAX(VLOOKUP(Report_4W!B17,tKategorien[],3),VLOOKUP(Report_4W!C17,tKategorien[[Limit diast. ]:[Kat.]],2))","v":{"$error":"#N/A"}},{"$f":"MAX(VLOOKUP(Report_4W!E17,tKategorien[],3),VLOOKUP(Report_4W!F17,tKategorien[[Limit diast. ]:[Kat.]],2))","v":{"$error":"#N/A"}},{"$f":"MAX(VLOOKUP(Report_4W!H17,tKategorien[],3),VLOOKUP(Report_4W!I17,tKategorien[[Limit diast. ]:[Kat.]],2))","v":{"$error":"#N/A"}},null,null,null,"2019-04-26","Morgen",{"$f":"INT(H17)+0.25","v":43581.25},{"$f":"VLOOKUP(tSequence[[#This Row],[Datum2]],tData[[Sort]:[Puls]],2,FALSE)","v":{"$error":"#N/A"}},{"$f":"VLOOKUP(tSequence[[#This Row],[Datum2]],tData[[Sort]:[Puls]],3,FALSE)","v":{"$error":"#N/A"}},{"$f":"VLOOKUP(tSequence[[#This Row],[Datum2]],tData[[Sort]:[Puls]],4,FALSE)","v":{"$error":"#N/A"}},{"$f":"MAX(VLOOKUP($K17,tKategorien[],3),VLOOKUP($L17,tKategorien[[Limit diast. ]:[Kat.]],2))","v":{"$error":"#N/A"}},{"$f":"MAX(VLOOKUP($K18,tKategorien[],3),VLOOKUP($L18,tKategorien[[Limit diast. ]:[Kat.]],2))","v":{"$error":"#N/A"}},{"$f":"MAX(VLOOKUP($K19,tKategorien[],3),VLOOKUP($L19,tKategorien[[Limit diast. ]:[Kat.]],2))","v":{"$error":"#N/A"}},null,null,null,null,"Mittags",null,null,null,null,null,null,{"$f":"COUNTIF(intermediate!$O$47:$O$67,AB$4)","v":0},{"$f":"COUNTIF(intermediate!$O$47:$O$67,AC$4)","v":0},{"$f":"COUNTIF(intermediate!$O$47:$O$67,AD$4)","v":0},{"$f":"COUNTIF(intermediate!$O$47:$O$67,AE$4)","v":0},{"$f":"COUNTIF(intermediate!$O$47:$O$67,AF$4)","v":0},{"$f":"COUNTIF(intermediate!$O$47:$O$67,AG$4)","v":0}]
[null,{"$f":"MAX(VLOOKUP(Report_4W!B18,tKategorien[],3),VLOOKUP(Report_4W!C18,tKategorien[[Limit diast. ]:[Kat.]],2))","v":{"$error":"#N/A"}},{"$f":"MAX(VLOOKUP(Report_4W!E18,tKategorien[],3),VLOOKUP(Report_4W!F18,tKategorien[[Limit diast. ]:[Kat.]],2))","v":{"$error":"#N/A"}},{"$f":"MAX(VLOOKUP(Report_4W!H18,tKategorien[],3),VLOOKUP(Report_4W!I18,tKategorien[[Limit diast. ]:[Kat.]],2))","v":{"$error":"#N/A"}},null,null,null,"2019-04-26","Mittag",{"$f":"INT(H18)+0.5","v":43581.5},{"$f":"VLOOKUP(tSequence[[#This Row],[Datum2]],tData[[Sort]:[Puls]],2,FALSE)","v":{"$error":"#N/A"}},{"$f":"VLOOKUP(tSequence[[#This Row],[Datum2]],tData[[Sort]:[Puls]],3,FALSE)","v":{"$error":"#N/A"}},{"$f":"VLOOKUP(tSequence[[#This Row],[Datum2]],tData[[Sort]:[Puls]],4,FALSE)","v":{"$error":"#N/A"}},null,null,null,null,null,null,null,"Abends",null,null,null,null,null,null,null,null,null,null,null,null,{"$f":"COUNTIF(intermediate!$P$47:$P$67,AH$4)","v":0},{"$f":"COUNTIF(intermediate!$P$47:$P$67,AI$4)","v":0},{"$f":"COUNTIF(intermediate!$P$47:$P$67,AJ$4)","v":0},{"$f":"COUNTIF(intermediate!$P$47:$P$67,AK$4)","v":0},{"$f":"COUNTIF(intermediate!$P$47:$P$67,AL$4)","v":0},{"$f":"COUNTIF(intermediate!$P$47:$P$67,AM$4)","v":0}]
[null,{"$f":"MAX(VLOOKUP(Report_4W!B19,tKategorien[],3),VLOOKUP(Report_4W!C19,tKategorien[[Limit diast. ]:[Kat.]],2))","v":{"$error":"#N/A"}},{"$f":"MAX(VLOOKUP(Report_4W!E19,tKategorien[],3),VLOOKUP(Report_4W!F19,tKategorien[[Limit diast. ]:[Kat.]],2))","v":{"$error":"#N/A"}},{"$f":"MAX(VLOOKUP(Report_4W!H19,tKategorien[],3),VLOOKUP(Report_4W!I19,tKategorien[[Limit diast. ]:[Kat.]],2))","v":{"$error":"#N/A"}},null,null,null,"2019-04-26","Abend",{"$f":"INT(H19)+0.75","v":43581.75},{"$f":"VLOOKUP(tSequence[[#This Row],[Datum2]],tData[[Sort]:[Puls]],2,FALSE)","v":{"$error":"#N/A"}},{"$f":"VLOOKUP(tSequence[[#This Row],[Datum2]],tData[[Sort]:[Puls]],3,FALSE)","v":{"$error":"#N/A"}},{"$f":"VLOOKUP(tSequence[[#This Row],[Datum2]],tData[[Sort]:[Puls]],4,FALSE)","v":{"$error":"#N/A"}}]
[null,{"$f":"MAX(VLOOKUP(Report_4W!B20,tKategorien[],3),VLOOKUP(Report_4W!C20,tKategorien[[Limit diast. ]:[Kat.]],2))","v":{"$error":"#N/A"}},{"$f":"MAX(VLOOKUP(Report_4W!E20,tKategorien[],3),VLOOKUP(Report_4W!F20,tKategorien[[Limit diast. ]:[Kat.]],2))","v":{"$error":"#N/A"}},{"$f":"MAX(VLOOKUP(Report_4W!H20,tKategorien[],3),VLOOKUP(Report_4W!I20,tKategorien[[Limit diast. ]:[Kat.]],2))","v":{"$error":"#N/A"}},null,null,null,"2019-04-27","Morgen",{"$f":"INT(H20)+0.25","v":43582.25},{"$f":"VLOOKUP(tSequence[[#This Row],[Datum2]],tData[[Sort]:[Puls]],2,FALSE)","v":{"$error":"#N/A"}},{"$f":"VLOOKUP(tSequence[[#This Row],[Datum2]],tData[[Sort]:[Puls]],3,FALSE)","v":{"$error":"#N/A"}},{"$f":"VLOOKUP(tSequence[[#This Row],[Datum2]],tData[[Sort]:[Puls]],4,FALSE)","v":{"$error":"#N/A"}},{"$f":"MAX(VLOOKUP($K20,tKategorien[],3),VLOOKUP($L20,tKategorien[[Limit diast. ]:[Kat.]],2))","v":{"$error":"#N/A"}},{"$f":"MAX(VLOOKUP($K21,tKategorien[],3),VLOOKUP($L21,tKategorien[[Limit diast. ]:[Kat.]],2))","v":{"$error":"#N/A"}},{"$f":"MAX(VLOOKUP($K22,tKategorien[],3),VLOOKUP($L22,tKategorien[[Limit diast. ]:[Kat.]],2))","v":{"$error":"#N/A"}},null,null,null,{"$f":"WEEKNUM(Start_4W,21)+3&\"/\"&YEAR(Start_4W)","v":"20/2019"},"Morgens",{"$f":"COUNTIF(intermediate!$N$68:$N$88,V$4)","v":0},{"$f":"COUNTIF(intermediate!$N$68:$N$88,W$4)","v":0},{"$f":"COUNTIF(intermediate!$N$68:$N$88,X$4)","v":0},{"$f":"COUNTIF(intermediate!$N$68:$N$88,Y$4)","v":0},{"$f":"COUNTIF(intermediate!$N$68:$N$88,Z$4)","v":0},{"$f":"COUNTIF(intermediate!$N$68:$N$88,AA$4)","v":0}]
{"$rows_left_out":69}
{"sheet":"data","index":2,"n_rows":2,"n_cols":7,"rows_kept":2,"cut":false,"hidden":true,"merged":[]}
["Datum1","Tageszeit","Sort","Systolisch","Diastolisch","Puls","Bemerkung"]
[null,null,{"$f":"tData[[#This Row],[Datum1]]+_xlfn.IFNA(VLOOKUP(tData[[#This Row],[Tageszeit]],tTageszeit[],3,FALSE), 0)","v":0}]

{"sheet":"settings","index":3,"n_rows":10,"n_cols":12,"rows_kept":10,"cut":false,"hidden":true,"merged":[]}
[]
[]
[null,"Tageszeit","Index","Zeitwert",null,"Limit syst.","Limit diast. ","Kat.",null,"Bedeutung","Wert","Default"]
[null,"Morgen",1,0.25,null,1,1,1,null,"Letzter Wert vom:",{"$f":"MAX(tData[Datum1])","v":"00:00:00"},{"$f":"MAX(tData[Datum1])","v":"00:00:00"}]
[null,"Mittag",2,0.5,null,90,60,2,null,"Kalenderwoche:",{"$f":"WEEKNUM(K4,21)&\"/\"&YEAR(K4)","v":"52/1900"}]
[null,"Abend",3,0.75,null,120,80,3,null,"4W_Start:","2019-04-22",{"$f":"$K4-WEEKDAY($K4,3)-21","v":-26}]
[null,null,null,null,null,140,90,4,null,"Nachname:"]
[null,null,null,null,null,160,100,5,null,"Vorname:"]
[null,null,null,null,null,180,110,6,null,"Geburtsdatum:"]
[null,null,null,null,null,null,null,null,null,"Mittagswerte verw.:",0,1]